{"text_format":"1","workbook":"xlsx","n_sheets":10,"sheets":["Formulario 1.1- Ingresos E.P","Formulario 1.1A - Cálculo I-E.P","Formulario 1.2 - Ingresos F.E ","Formulario 1.2A-Cálculo I-F.E","Formulario 2- Gasto","Formulario 3-Clas. Económica","Formulario 4- Planta","Formulario 4A - Nómina","Formulario 5- Deuda Pública","DESPLEGABLES"],"not_rendered":{"charts":0,"images":1,"macros":1,"external_links":0,"defined_names":38,"comments":9,"pivot_tables":0},"unopened":[],"bounds":{"document_bytes":16777216,"sheet_cells":100000,"rows_first":2000,"rows_last":500,"rows_between":2000,"halvings":0,"cell_chars":16384,"cell_head_chars":4096},"cells_cut":0,"cells_raw":0,"read":"whole","date_system":"1900"}

{"sheet":"Formulario 1.1- Ingresos E.P","index":0,"n_rows":106,"n_cols":9,"rows_kept":106,"cut":false,"hidden":false,"merged":[[97,0,97,5],[18,8,19,8],[0,0,0,8],[1,0,1,8],[2,0,2,8],[4,5,4,7],[5,5,5,7],[6,5,6,7],[18,5,19,5],[18,6,19,6],[18,7,19,7],[4,1,4,4],[5,1,5,4],[6,1,6,4],[18,0,18,4]]}
["MINISTERIO DE HACIENDA Y CRÉDITO PÚBLICO "]
["Dirección General del Presupuesto Público Nacional"]
["Formulario 1.1 Anteproyecto Ingresos - Establecimientos Públicos"]
[]
[null,"TIPO DE INGRESO REGISTRADO",null,null,null,"ESTABLECIMIENTOS PÚBLICOS"]
[null,"SECCIÓN"]
[null,"UNIDAD EJECUTORA",null,null,null,{"$f":"IFERROR(VLOOKUP(F6,DESPLEGABLES!A2:B197,2,FALSE),\"\")","v":""}]
[]
[null,null,null,null,null,"ANTEPROYECTO DE PRESUPUESTO DE INGRESO - VIGENCIA",2019,null,"(diligenciar en pesos)"]
[]
{"$rows_left_out":97}
{"sheet":"Formulario 1.1A - Cálculo I-E.P","index":1,"n_rows":112,"n_cols":15,"rows_kept":112,"cut":false,"hidden":false,"merged":[[9,1,12,1],[7,0,7,1],[0,0,0,15],[1,0,1,15],[2,0,2,15],[5,1,5,6],[4,1,4,6],[9,3,9,5],[9,6,9,8],[9,9,9,14],[9,0,12,0],[10,9,10,10],[10,11,10,12]]}
["MINISTERIO DE HACIENDA Y CRÉDITO PÚBLICO"]
["Dirección General del Presupuesto Público Nacional"]
["Formulario 1.1A Cálculo de ingresos corrientes por productos - Establecimientos Públicos"]
[]
["SECCIÓN"]
["UNIDAD EJECUTORA",{"$f":"IFERROR(VLOOKUP(B5,DESPLEGABLES!A2:B197,2,FALSE),\"\")","v":""}]
[null,null,null,null,null,null,null,null,null,null,"(diligenciar en pesos)"]
["CÁLCULO DE LOS INGRESOS CORRIENTES POR PRODUCTO - VIGENCIA ",null,2019]
[]
["Producto","Clasificación Central de Producto",null,"Vigencia anterior (t-1)",null,null,"Vigencia en curso (t)",null,null,"Próxima Vigencia (t+1)"]
{"$rows_left_out":103}
{"sheet":"Formulario 1.2 - Ingresos F.E ","index":2,"n_rows":92,"n_cols":9,"rows_kept":92,"cut":false,"hidden":false,"merged":[[83,0,83,5],[6,5,6,7],[4,1,4,4],[5,1,5,4],[6,1,6,4],[7,1,7,4],[20,0,20,4],[8,5,8,7],[0,1,0,8],[1,1,1,8],[2,1,2,8],[4,5,4,7],[5,5,5,7],[20,8,21,8],[10,2,10,5],[20,5,21,5],[20,6,21,6],[20,7,21,7]]}
[null,"MINISTERIO DE HACIENDA Y CRÉDITO PÚBLICO "]
[null,"Dirección General del Presupuesto Público Nacional"]
[null,"Formulario 1.2. Anteproyecto Ingresos - Fondos Especiales "]
[]
[null,"TIPO DE INGRESO REGISTRADO",null,null,null,"FONDOS ESPECIALES - CONTRIBUCIONES PARAFISCALES DE LA NACIÓN"]
[null,"SECCIÓN"]
[null,"UNIDAD EJECUTORA",null,null,null,{"$f":"IFERROR(VLOOKUP(F6,DESPLEGABLES!A2:B197,2,FALSE),\"\")","v":""}]
[null," NOMBRE DEL FONDO ESPECIAL",null,null,null,null,"CÓDIGO SIIF",{"$f":"IFERROR(VLOOKUP(F8,DESPLEGABLES!D1:E69,2,FALSE),\"\")","v":""}]
[null,null,null,null,null,"(SI EL NOMBRE DEL FONDO ESPECIAL NO APARECE EN LA LISTA DESPLEGABLE POR FAVOR  REGÍSTRELO AQUÍ)"]
[]
{"$rows_left_out":83}
{"sheet":"Formulario 1.2A-Cálculo I-F.E","index":3,"n_rows":113,"n_cols":15,"rows_kept":113,"cut":false,"hidden":false,"merged":[[10,0,13,0],[10,1,13,1],[10,3,10,5],[10,6,10,8],[10,9,10,14],[11,9,11,10],[11,11,11,12],[8,0,8,1],[6,1,6,6],[0,0,0,15],[1,0,1,15],[2,0,2,15],[4,1,4,6],[5,1,5,6]]}
["MINISTERIO DE HACIENDA Y CRÉDITO PÚBLICO"]
["Dirección General del Presupuesto Público Nacional"]
["Formulario 1.2A Cálculo de ingresos corrientes por productos - Fondos Especiales "]
[]
["SECCIÓN"]
["UNIDAD EJECUTORA",{"$f":"IFERROR(VLOOKUP(B5,DESPLEGABLES!A2:B197,2,FALSE),\"\")","v":""}]
[" NOMBRE DEL FONDO ESPECIAL"]
[]
["CÁLCULO DE LOS INGRESOS CORRIENTES POR PRODUCTO - VIGENCIA ",null,2019,null,null,null,null,null,"(diligenciar en pesos)"]
[]
{"$rows_left_out":104}
{"sheet":"Formulario 2- Gasto","index":4,"n_rows":704,"n_cols":15,"rows_kept":704,"cut":false,"hidden":false,"merged":[[12,14,14,14],[13,1,14,1],[13,2,14,2],[13,3,14,3],[698,4,700,4],[698,5,698,7],[12,0,12,3],[698,8,698,10],[698,11,698,13],[694,0,694,4],[695,0,695,4],[13,0,14,0],[0,3,0,13],[1,3,1,13],[2,3,2,13],[12,5,12,7],[12,8,12,10],[12,4,14,4],[4,4,4,6],[5,4,5,6],[7,1,7,5],[12,11,12,13],[5,0,5,3],[4,0,4,3]]}
[null,null,null,"MINISTERIO DE HACIENDA Y CRÉDITO PÚBLICO"]
[null,null,null,"Dirección General del Presupuesto Público Nacional"]
[null,null,null,"Formulario 2. Anteproyecto Presupuesto de Gastos"]
[]
["SECCIÓN"]
["UNIDAD EJECUTORA",null,null,null,{"$f":"IFERROR(VLOOKUP(E5,DESPLEGABLES!A2:B197,2,FALSE),\"\")","v":""}]
[]
[null,"ANTEPROYECTO DE PRESUPUESTO DE GASTOS  - VIGENCIA",null,null,null,null,2019]
[]
[]
{"$rows_left_out":695}
{"sheet":"Formulario 3-Clas. Económica","index":5,"n_rows":56,"n_cols":17,"rows_kept":56,"cut":false,"hidden":false,"merged":[[0,0,0,16],[1,0,1,16],[2,0,2,16],[14,16,15,16],[9,5,9,16],[10,2,10,4],[10,5,10,11],[10,12,10,14],[14,0,15,0],[14,1,15,1],[14,2,15,2],[14,3,15,3],[14,4,15,4],[14,5,15,5],[9,0,9,4],[4,3,4,14],[5,3,5,14],[7,2,7,10],[4,1,4,2],[5,1,5,2],[14,12,15,12],[16,16,17,16],[18,0,19,0],[18,1,19,1],[18,2,19,2],[18,3,19,3],[18,4,19,4],[18,6,19,6],[18,12,19,12],[18,14,19,14],[18,16,19,16],[16,6,17,6],[16,7,17,7],[16,8,17,8],[16,11,17,11],[16,12,17,12],[16,14,17,14],[16,0,17,0],[16,1,17,1],[16,2,17,2],[16,3,17,3],[16,4,17,4],[16,5,17,5],[16,9,17,9],[18,5,19,5],[22,16,23,16],[20,13,21,13],[20,16,21,16],[22,0,23,0],[22,1,23,1],[22,2,23,2],[22,3,23,3],[22,4,23,4],[22,5,23,5],[22,6,23,6],[22,7,23,7],[20,0,21,0],[20,1,21,1],[20,2,21,2],[20,3,21,3],[20,4,21,4],[20,6,21,6],[20,7,21,7],[20,5,21,5],[24,2,25,2],[24,3,25,3],[24,4,25,4],[24,5,25,5],[22,8,23,8],[22,9,23,9],[22,10,23,10],[22,11,23,11],[22,13,23,13],[24,10,25,10],[28,0,29,0],[28,1,29,1],[28,2,29,2],[28,3,29,3],[28,4,29,4],[28,5,29,5],[24,14,25,14],[24,16,25,16],[26,0,27,0],[26,1,27,1],[26,2,27,2],[26,3,27,3],[26,4,27,4],[26,5,27,5],[26,6,27,6],[26,7,27,7],[24,6,25,6],[24,7,25,7],[24,8,25,8],[24,9,25,9],[24,11,25,11],[24,12,25,12],[24,0,25,0],[24,1,25,1],[28,6,29,6],[28,7,29,7],[28,8,29,8],[28,11,29,11],[28,15,29,15],[28,16,29,16],[28,12,29,12],[26,8,27,8],[26,11,27,11],[26,13,27,13],[26,16,27,16],[26,10,27,10],[28,10,29,10],[32,16,33,16],[30,16,31,16],[32,0,33,0],[32,1,33,1],[32,2,33,2],[32,3,33,3],[32,4,33,4],[32,5,33,5],[32,6,33,6],[32,7,33,7],[32,8,33,8],[30,6,31,6],[30,7,31,7],[30,8,31,8],[30,9,31,9],[30,10,31,10],[30,11,31,11],[30,0,31,0],[30,1,31,1],[30,2,31,2],[30,3,31,3],[30,4,31,4],[30,5,31,5],[32,10,33,10],[18,8,19,8],[20,8,21,8],[14,9,15,9],[16,10,17,10],[14,6,15,6],[14,7,15,7],[14,8,15,8],[14,10,15,10],[14,11,15,11],[18,10,19,10],[20,10,21,10],[32,9,33,9],[28,9,29,9],[26,9,27,9],[20,9,21,9],[18,9,19,9],[30,12,31,12],[32,12,33,12],[32,13,33,13],[30,13,31,13],[28,13,29,13],[24,13,25,13],[20,11,21,11],[18,11,19,11],[20,12,21,12],[22,12,23,12],[26,12,27,12],[32,11,33,11],[32,14,33,14],[32,15,33,15],[30,15,31,15],[26,15,27,15],[18,13,19,13],[16,13,17,13],[14,13,15,13],[14,14,15,14],[20,14,21,14],[22,14,23,14],[24,15,25,15],[22,15,23,15],[20,15,21,15],[18,15,19,15],[16,15,17,15],[14,15,15,15],[26,14,27,14],[28,14,29,14],[30,14,31,14],[43,0,43,4],[43,5,43,16],[44,0,44,4],[44,5,44,16],[47,0,47,4],[46,5,46,16],[46,0,46,4],[48,5,48,16],[45,0,45,4],[45,5,45,16],[47,5,47,16],[52,5,52,16],[54,5,54,6],[50,5,50,6],[52,0,52,4],[53,5,53,16],[49,0,49,4],[49,5,49,16],[48,0,48,4],[55,5,55,16],[51,0,51,4],[50,0,50,4],[51,5,51,16]]}
["MINISTERIO DE HACIENDA Y CRÉDITO PÚBLICO "]
["Dirección General del Presupuesto Público Nacional"]
["Formulario 3. Clasificación económica de los gastos de funcionamiento"]
[]
[null,"SECCIÓN"]
[null,"UNIDAD EJECUTORA",null,{"$f":"IFERROR(VLOOKUP(D5,DESPLEGABLES!A2:B197,2,FALSE),\"\")","v":""}]
[]
[null,null,"ANTEPROYECTO CLASIFICACIÓN ECONÓMICA DE LOS GASTOS DE FUNCIONAMIENTO - VIGENCIA",null,null,null,null,null,null,null,null,2019,null,"(diligenciar en pesos)"]
[]
["CLASIFICADOR PRESUPUESTAL",null,null,null,null,"CLASIFICADOR ECONÓMICO"]
{"$rows_left_out":47}
{"sheet":"Formulario 4- Planta","index":6,"n_rows":76,"n_cols":44,"rows_kept":76,"cut":false,"hidden":false,"merged":[[9,42,11,42],[9,32,11,32],[9,33,11,33],[9,34,11,34],[9,35,11,35],[9,41,11,41],[9,40,11,40],[10,16,11,16],[10,17,11,17],[9,36,11,36],[9,37,11,37],[9,39,11,39],[10,18,11,18],[10,19,11,19],[9,21,11,21],[9,38,11,38],[10,20,11,20],[10,11,11,11],[10,12,11,12],[10,13,11,13],[10,15,11,15],[10,14,11,14],[10,6,11,6],[10,7,11,7],[10,8,11,8],[10,9,11,9],[10,10,11,10],[4,1,4,11],[6,3,6,10],[8,0,11,0],[8,1,11,1],[0,0,0,43],[1,0,1,43],[3,1,3,11],[2,0,2,43],[8,32,8,42],[8,43,11,43],[8,2,11,2],[8,3,8,21],[9,3,9,15],[9,16,9,20],[10,3,10,4],[10,5,11,5],[8,22,8,31],[9,26,9,30],[10,26,11,26],[10,27,11,27],[10,28,11,28],[10,30,11,30],[9,31,11,31],[9,22,9,25],[10,22,11,22],[10,23,11,23],[10,25,11,25],[10,24,11,24],[10,29,11,29]]}
["MINISTERIO DE HACIENDA Y CRÉDITO PÚBLICO "]
["Dirección General del Presupuesto Público Nacional"]
["Formulario 4. Anteproyecto Planta de personal"]
["SECCIÓN"]
["UNIDAD EJECUTORA",{"$f":"IFERROR(VLOOKUP(B4,DESPLEGABLES!A2:B197,2,FALSE),\"\")","v":""}]
[]
[null,null,null,"ANTEPROYECTO PLANTA DE PERSONAL - VIGENCIA",null,null,null,null,null,null,null,2019,null,null,"(diligenciar en pesos)"]
[]
["DENOMINACIÓN DE CARGOS","Grado","No. Cargos","Salario",null,null,null,null,null,null,null,null,null,null,null,null,null,null,null,null,null,null,"Remuneraciones no constitutivas de Factor Salarial",null,null,null,null,null,null,null,null,null,"Contribuciones Inherentes a la Nómina",null,null,null,null,null,null,null,null,null,null,"Total"]
[null,null,null,"Factores Salariales comunes",null,null,null,null,null,null,null,null,null,null,null,null,"Factores Salariales Especiales",null,null,null,null,"Total","Prestaciones sociales según definición legal",null,null,null,"Otras remuneraciones no constitutivas de Factor Salarial",null,null,null,null,"Total","Pensiones","Salud","Aportes de Cesantías","Cajas de Compensación Familiar","Aportes Generales al Sistema de Riesgos Laborales","Aportes al ICBF","Aportes al SENA","Aportes a la ESAP","Aportes a escuelas industriales e institutos técnicos","Subsidio de vivienda Fuerzas Militares y Policía","Total"]
{"$rows_left_out":67}
{"sheet":"Formulario 4A - Nómina","index":7,"n_rows":39,"n_cols":7,"rows_kept":39,"cut":false,"hidden":false,"merged":[[38,4,38,6],[37,4,37,6],[7,1,7,3],[9,6,11,6],[0,0,0,7],[1,0,1,7],[2,0,2,7],[9,1,11,1],[9,2,11,2],[9,3,11,3],[9,4,11,4],[9,5,11,5],[4,2,4,6],[5,2,5,6]]}
["MINISTERIO DE HACIENDA Y CRÉDITO PÚBLICO "]
["Dirección General del Presupuesto Público Nacional"]
["Formulario 4A Certificación de Nómina"]
[]
[null,"SECCIÓN"]
[null,"UNIDAD EJECUTORA",{"$f":"IFERROR(VLOOKUP(C5,DESPLEGABLES!A2:B196,2,FALSE),\"\")","v":""}]
[]
[null,"ANTEPROYECTO COSTO DE NÓMINA - VIGENCIA",null,null,2019,null,"(diligenciar en pesos)"]
[]
[null,"DENOMINACIÓN DE CARGO","Grado","Cargos Provistos","Cargos Vacantes","Total Cargos de Planta","Asignación Básica Mensual"]
{"$rows_left_out":30}
{"sheet":"Formulario 5- Deuda Pública","index":8,"n_rows":12,"n_cols":13,"rows_kept":12,"cut":false,"hidden":false,"merged":[[9,8,11,8],[9,9,9,12],[10,9,11,9],[10,10,11,10],[10,11,11,11],[10,12,11,12],[0,0,0,12],[1,0,1,12],[2,0,2,12],[9,0,11,0],[9,1,11,1],[4,3,4,10],[5,3,5,10],[4,1,4,2],[5,1,5,2],[9,2,10,3],[9,4,9,7],[10,4,11,4],[7,2,7,7],[10,5,11,5],[10,6,11,6],[10,7,11,7]]}
["MINISTERIO DE HACIENDA Y CRÉDITO PÚBLICO "]
["Dirección General del Presupuesto Público Nacional"]
["Formulario 5. Pagos Programados de Deuda Pública"]
[]
[null,"SECCIÓN"]
[null,"UNIDAD EJECUTORA",null,{"$f":"IFERROR(VLOOKUP(D5,DESPLEGABLES!A2:B197,2,FALSE),\"\")","v":""}]
[]
[null,null,"ANTEPROYECTO DEUDA PÚBLICA - VIGENCIA",null,null,null,null,null,2019,null,null,"(diligenciar en pesos)"]
[]
["Clase de Prestamista","Identificación Código del Empréstito","Saldo Emprestito Moneda Original",null,"Pagos Próxima Vigencia, (t+1), (Moneda Original)",null,null,null,"Tipo de Cambio","Pagos Próxima Vigencia, (t+1), (Pesos Colombianos)"]
{"$rows_left_out":3}
{"sheet":"DESPLEGABLES","index":9,"n_rows":196,"n_cols":37,"rows_kept":196,"cut":false,"hidden":false,"merged":[]}
["SECCIÓN ","UNIDAD EJECUTORA ",null,null,"COD",null,"IMPUESTOS INDIRECTOS -FE","CÓD ",null,"CONTRIBUCIONES SOCIALES- EP","CÓD",null,"CONTRIBUCIONES SOCIALES -FE","CÓD",null,"CONTRIBUCIONES DIVERSAS - FE","CÓD",null,"CONTRIBUCIONES DIVERSAS - ESTAPÚBLICO","CÓD",null,"TASAS Y DERECHOS ADMINISTRATIVOS - EP","CÓD",null,"DERECHOS ECONÓMICOS POR USO DE RECURSOS NATURALES- EP","CÓD",null,"DERECHOS ECONÓMICOS POR USO DE RECURSOS NATURALES- FE","CÓD",null,"TRANSFERENCIAS CORRIENTES- EP","CÓD",null,"TRANSFERENCIAS CORRIENTES- FE","CÓD",null,"CPC"]
["010101","CONGRESO DE LA REPUBLICA  SENADO GESTION GENERAL",null,"CONTRIBUCIÓN ENTIDADES VIGILADAS CONTRALORIA GENERAL NACION",602,null,"Impuesto social a las armas y municiones",10,null,"Salud","01",null,"Salud","01",null,"Contribución - Comisión de Regulación de Comunicaciones (CRC)","01",null,"Contribución - Superintendencia de Sociedades","04",null,"Expedición de visas","01",null,"Derecho económico por uso del subsuelo","01",null,"Regalías y compensaciones monetarias","04",null,"Indemnizaciones relacionadas con seguros no de vida","01",null,"Indemnizaciones relacionadas con seguros no de vida","01",null,"Agricultura, silvicultura y productos de la pesca"]
["010102","CONGRESO DE LA REPUBLICA - CAMARA DE REPRESENTANTES - GESTION GENERAL",null,"CONTRIBUCIÓN ENTIDADES VIGILADAS SUPERINTENDENCIA SUBSIDIO FAMILIAR",603,null,"Impuesto de remate y adjudicaciones",11,null,"Pensión","02",null,"Pensión","02",null,"Contribución - Comisión de Regulación de Energía y Gas (CREG)","02",null,"Contribución - Superintendencia de Vigilancia y Seguridad Privada","05",null,"Expedición de pasaportes","02",null,"Concesiones mineras","02",null,null,null,null,"Sentencias y conciliaciones","02",null,"Sentencias y conciliaciones","02",null,"Minerales; electricidad, gas y agua"]
["020101","PRESIDENCIA DE LA REPUBLICA - GESTION GENERAL",null,"FINANCIACION SECTOR JUSTICIA",609,null,"Sobretasa nacional a la gasolina",12,null,"Contribuciones asignaciones de retiro militares y policía","03",null,null,null,null,"Contribución - Comisión de Regulación de Agua Potable y Saneamiento Básico (CRA)","03",null,"Contribución - Superintendencia de la Economía Solidaria","06",null,"Apostilla o legalización","03",null,"Contraprestaciones portuarias","03",null,null,null,null,"Devolución IVA","04",null,"Prescripción de depósitos judiciales","03",null,"Productos alimenticios, bebidas y tabaco; textiles, prendas de vestir y productos de cuero"]
["020900","AGENCIA PRESIDENCIAL DE COOPERACIÓN INTERNACIONAL DE COLOMBIA, APC - COLOMBIA",null,"FONDO DE DEFENSA NACIONAL",6010,null,"Sobretasa al ACPM",13,null,null,null,null,null,null,null,"Contribución - Superintendencia del Subsidio Familiar","07",null,"Contribución de vigilancia - Superintendencia de Industria y Comercio","08",null,"Protocolización de escrituras públicas","04",null,"Concesiones parques naturales","05",null,null,null,null,"Transferencias de otras unidades de gobierno","05",null,"Devolución IVA","04",null,"Otros bienes transportables, (excepto productos metálicos, maquinaria y equipo)"]
["021100","UNIDAD NACIONAL PARA LA GESTIÓN DEL RIESGO DE DESASTRES",null,"FONDO ESTUPEFACIENTES - MINSALUD",6013,null,"Impuesto de salida de extranjeros",15,null,"CONTRIBUCIONES ASOCIADAS A NÓMINA - EP","CÓD",null,"CONTRIBUCIONES ASOCIADAS A NÓMINA -FE","CÓD",null,"Contribución - Fondo de Compensación Ambiental",13,null,"Contribución de seguimiento - Superintendencia de Industria y Comercio","09",null,"Expedición de certificaciones en el exterior","05",null,null,null,null,null,null,null,"Recursos por bienes mostrencos y vocaciones hereditarias","07",null,"Transferencias de otras unidades de gobierno","05",null,"Productos metálicos, maquinaria y equipo"]
["021200","AGENCIA COLOMBIANA PARA LA REINTEGRACIÓN DE PERSONAS Y GRUPOS ALZADOS EN ARMAS",null,"FONDOS INTERNOS MINISTERIO DEFENSA",6014,null,null,null,null,"ICBF","01",null,"Escuelas industriales e institutos técnicos","04",null,"Contribución - Fondo Apoyo Financiero Zonas No Interconectadas (FAZNI) ",14,null,"Contribución - Superintendencia Financiera de Colombia","10",null,"Certificación sobre la existencia legal de sociedades","06",null,null,null,null,null,null,null,"Compensación UPC – SSS","09",null,"Recursos en consignación","06",null,"Construcción y servicios de la construcción"]
["021300","AGENCIA NACIONAL INMOBILIARIA VIRGILIO BARCO VARGAS",null,"FONDOS INTERNOS POLICIA NACIONAL",6015,null,null,null,null,"SENA","02",null,"Aportes de cesantías","05",null,"Contribución - Fondo Apoyo Financiero para la Energización de las Zonas Rurales Interconectadas (FAER)",15,null,"Contribución - Superintendencia de Servicios Públicos Domiciliarios","11",null,"Reconocimiento y autenticación de firmas ante cónsules colombianos","07",null,"CÁLCULO POR INGRESOS CORRIENTES",null,null,null,null,null,null,null,null,"Recursos por procesos de extinción de dominio","08",null,"Servicios de venta y de distribución; alojamiento; servicios de suministro de comidas y bebidas; servicios de transporte; y servicios de distribución de electricidad, gas y agua"]
["021400","AGENCIA DE RENOVACION DEL TERRITORIO – ART",null,"FONDO ROTATORIO DE MINAS Y ENERGÍA",6017,null,null,null,null,"ESAP","03",null,null,null,null,"Contribución - Fondo de Energías No Convencionales y Gestión Eficiente de la Energía (FENOGE)",16,null,"Contribución pensionados militares y policía",23,null,"Expedición de tarjetas de registro consular","08",null,null,null,null,null,null,null,null,null,null,"Compensación UPC – SSS","09",null,"Servicios financieros y servicios conexos, servicios inmobiliarios y servicios de leasing"]
["030101","DEPARTAMENTO DE PLANEACION - GESTION GENERAL",null,"FONDO NACIONAL DE REGALIAS",6018,null,null,null,null,null,null,null,null,null,null,"Contribución - Fondo Especial de Energía Social (FOES)",17,null,"Derecho económico por precios altos",33,null,"Trámite de nacionalidad colombiana por adopción","09",null,"CONTRIBUCIONES SOCIALES- EP",null,null,"TASAS Y DERECHOS ADMINISTRATIVOS - EP",null,null,"IMPUESTOS INDIRECTOS -FE",null,null,null,null,null,"Servicios prestados a las empresas y servicios de producción"]
{"$rows_left_out":186}